{"text_format":"3","workbook":"xlsx","n_sheets":6,"sheets":["Home","Personal Details","Travel Details","Hotel and Activities","Car Rental","Emergency Details"],"not_rendered":{"images":19,"defined_names":10},"read":"whole","date_system":"1900"}

{"sheet":"Home","index":0,"n_rows":34,"n_cols":22,"rows_kept":34,"merged":[[32,1,32,3],[32,6,32,8],[32,11,32,13],[32,16,32,18],[32,21,32,23],[33,1,33,3],[33,6,33,8],[33,11,33,13],[33,16,33,18],[33,21,33,23]]}
{"$rows_empty":32}
[null,{"$f":"PersonalEntry/PersonalCount","v":{"v":1,"d":"100%"}},{"$nulls":4},{"$f":"TravelEntry/TravelCount","v":{"v":0.65,"d":"65%"}},{"$nulls":4},{"$f":"HotelEntry/HotelCount","v":{"v":0.5384615384615384,"d":"54%"}},{"$nulls":4},{"$f":"IF('Car Rental'!D4=\"Yes\",CarRentalEntry/CarRentalCount,1)","v":{"v":0.2857142857142857,"d":"29%"}},{"$nulls":4},{"$f":"EmergencyEntry/EmergencyCount","v":{"v":0.625,"d":"63%"}}]
[null,{"$f":"TEXT(B33,\"0% \"\"complete\"\"\")","v":"100% complete"},{"$nulls":4},{"$f":"TEXT(G33,\"0% \"\"complete\"\"\")","v":"65% complete"},{"$nulls":4},{"$f":"TEXT(L33,\"0% \"\"complete\"\"\")","v":"54% complete"},{"$nulls":4},{"$f":"TEXT(Q33,\"0% \"\"complete\"\"\")","v":"29% complete"},{"$nulls":4},{"$f":"TEXT(V33,\"0% \"\"complete\"\"\")","v":"63% complete"}]

{"sheet":"Personal Details","index":1,"n_rows":11,"n_cols":5,"rows_kept":11,"merged":[[4,2,5,2],[4,3,5,3],[4,4,5,4],[7,2,8,2],[7,3,8,3],[7,4,8,4],[17,1,17,4]]}
[]
[]
[{"$f":"IF(COUNTA(B4:B8)<1,\"*\",\"\")","v":""},"Full Names & Nicknames",{"$f":"IF(E3=\"\",1,\"\")","v":""},"Home Address","987 North Fifth Street Columbus, TN 01234"]
[null,"Michael Alexander"]
[null,"Michelle Alexander",{"$f":"IF(E5=\"\",1,\"\")","v":""},"Home Phone",3455550123]
[null,"Sean P. Alexander"]
[]
[null,null,{"$f":"IF((E8=0)+(E8=\"\"),1,\"\")","v":""},"Cellular Phones",3455550124]
[]
[]
[{"$f":"PersonalEntry","v":3},{"$f":"IF(A11<>PersonalCount,\"Missing important details\",\"Important details complete\")","v":"Important details complete"}]

{"sheet":"Travel Details","index":2,"n_rows":18,"n_cols":6,"rows_kept":18,"merged":[[23,1,23,5]]}
[]
[]
[null,"Departure Details",null,null,"Return Details"]
[{"$f":"IF(C4=\"\",1,\"\")","v":""},"Date",{"$f":"TODAY()+45","v":"2012-10-12"},{"$f":"IF(F4=\"\",1,\"\")","v":""},"Date",{"$f":"TODAY()+51","v":"2012-10-18"}]
[{"$f":"IF(C5=\"\",1,\"\")","v":""},"Airline","Blue Yonder Airlines","","Airline","Blue Yonder Airlines"]
[{"$f":"IF(C6=\"\",1,\"\")","v":""},"Flight Number","WS192",1,"Flight Number"]
[{"$f":"IF(C7=\"\",1,\"\")","v":""},"From","Columbus","","From","Seattle"]
[{"$f":"IF(C8=\"\",1,\"\")","v":""},"Departure Time","12:30:00",1,"Departure Time"]
[null,"Departure Terminal/Gate",null,1,"Departure Terminal/Gate"]
[{"$f":"IF(C10=\"\",1,\"\")","v":""},"To","Seattle",1,"To"]
[{"$f":"IF(C11=\"\",1,\"\")","v":""},"Arrival Time","12:32:00",1,"Arrival Time"]
[null,"Length of Flight","6 hours",null,"Length of Flight"]
[{"$f":"IF(C13=\"\",1,\"\")","v":""},"Seat Numbers","A1, A2,A3",{"$f":"IF(F13=\"\",1,\"\")","v":1},"Seat Numbers"]
[{"$f":"IF(C14=\"\",1,\"\")","v":""},"Confirmation Numbers","Same",{"$f":"IF(F14=\"\",1,\"\")","v":1},"Confirmation Numbers"]
[{"$f":"IF(C15=\"\",1,\"\")","v":""},"Meal","No restrictions",null,"Meal"]
[null,"Airline Telephone Number",1235550234,null,"Airline Telephone Number",1235550234]
[]
[{"$f":"TravelEntry","v":13},{"$f":"IF(A18<>TravelCount,\"Missing Important details\",\"Important details complete\")","v":"Missing Important details"}]

{"sheet":"Hotel and Activities","index":3,"n_rows":15,"n_cols":7,"rows_kept":15,"merged":[[21,1,21,6]]}
[]
[]
[null,"Hotel Stay / Lodging Details",{"$nulls":3},"Vacation Activity Details"]
[{"$f":"IF(C4=\"\",1,\"\")","v":""},"Date of Reservation",{"$f":"TODAY()+45","v":"2012-10-12"},null,null,"Activity 1","Skiing"]
["","Hotel Name","Alpine Ski House",null,{"$f":"IF(AND($G$4<>\"\",G5=\"\"),1,\"\")","v":1},"Dates/Times"]
["","Hotel Address","789 Main Street",null,{"$f":"IF(AND($G$4<>\"\",G6=\"\"),1,\"\")","v":1},"Date of Reservation"]
["","Hotel Phone Number","Seattle",null,{"$f":"IF(AND($G$4<>\"\",G7=\"\"),1,\"\")","v":1},"Confirmation Number"]
["","Check-in Day/Time",{"$f":"TODAY()+45.5","v":"2012-10-12T12:00:00"},null,null,"Activity 2","Coho Vineyard & Winery"]
["","Check-out Day/Time",{"$f":"TODAY()+50.5","v":"2012-10-17T12:00:00"},null,{"$f":"IF(AND($G$8<>\"\",G9=\"\"),1,\"\")","v":1},"Dates/Times"]
["","Confirmation Number","CJ1234567",null,{"$f":"IF(AND($G$8<>\"\",G10=\"\"),1,\"\")","v":1},"Date of Reservation"]
[{"$nulls":4},{"$f":"IF(AND($G$8<>\"\",G11=\"\"),1,\"\")","v":1},"Confirmation Number"]
[{"$f":"HotelEntry","v":7},{"$f":"IF(A12<>HotelCount,\"Missing important details\",\"Important details complete\")","v":"Missing important details"},{"$nulls":3},"Activity 3"]
[{"$nulls":4},{"$f":"IF(AND($G$12<>\"\",G13=\"\"),1,\"\")","v":""},"Dates/Times"]
[{"$nulls":4},{"$f":"IF(AND($G$12<>\"\",G14=\"\"),1,\"\")","v":""},"Date of Reservation"]
[{"$nulls":4},{"$f":"IF(AND($G$12<>\"\",G15=\"\"),1,\"\")","v":""},"Confirmation Number"]

{"sheet":"Car Rental","index":4,"n_rows":13,"n_cols":4,"rows_kept":13,"merged":[[18,0,18,4]]}
[]
[]
[null,null,"Car Rental Information"]
[null,null,"Renting a car?","Yes"]
[null,{"$f":"IF(AND($D$4=\"Yes\",D5=\"\"),1,\"\")","v":""},"Date of Reservation",{"$f":"TODAY()+45","v":"2012-10-12"}]
[null,1,"Rental Company"]
[null,1,"Pickup Day/Time"]
[null,1,"Drop-off Day/Time"]
[null,1,"Confirmation Number"]
[null,"","Vehicle type","Economy"]
[null,1,"Telephone number"]
[]
[null,{"$f":"CarRentalEntry","v":2},{"$f":"IF(B13<>CarRentalCount,\"Missing important details\",\"Important details complete\")","v":"Missing important details"}]

{"sheet":"Emergency Details","index":5,"n_rows":11,"n_cols":6,"rows_kept":11,"merged":[[3,4,4,4],[3,5,4,5],[3,6,4,6],[5,4,6,4],[5,5,6,5],[5,6,6,6],[7,5,8,5],[7,6,8,6],[16,1,16,6]]}
[]
[]
[null,"Insurance Details",{"$nulls":3},"Emergency Contact Details"]
[{"$f":"IF(C4=\"\",1,\"\")","v":""},"Insurance Company","Humongous Insurance",null,{"$f":"IF(G4=\"\",1,\"\")","v":1},"Name / Relationship / Phone"]
["","Telephone Number",1235550567]
["","Coverage Type","1900-01-05",null,{"$f":"IF(G6=\"\",1,\"\")","v":1},"Name / Relationship / Phone"]
["","Confirmation Number","1900-01-05"]
["","Purchase Date",{"$f":"TODAY()","v":"2012-08-28"},null,null,"Name / Relationship / Phone"]
[1,"Coverage Dates"]
[]
[{"$f":"EmergencyEntry","v":5},{"$f":"IF(A11<>EmergencyCount,\"Missing important details\",\"Important details complete\")","v":"Missing important details"}]